p_vid,aa_pos,aa_ref,aa_alt,provean_score,sift_score,evm_epistatic_score,integrated_fitCons_score,LRT_score,GERP++_RS,phyloP30way_mammalian,phastCons30way_mammalian,SiPhy_29way_logOdds,blosum100,in_domain,asa_mean,aa_psipred_E,aa_psipred_H,aa_psipred_C,bsa_max,h_bond_max,salt_bridge_max,disulfide_bond_max,covelent_bond_max,solv_ne_abs_max,mw_delta,pka_delta,pkb_delta,pi_delta,hi_delta,pbr_delta,avbr_delta,vadw_delta,asa_delta,cyclic_delta,charge_delta,positive_delta,negative_delta,hydrophobic_delta,polar_delta,ionizable_delta,aromatic_delta,aliphatic_delta,hbond_delta,sulfur_delta,essential_delta,size_delta,weight
B1AK53,719,S,R,-2.65,0.001,,0.695654,0.006445,4.02,1.214,0.631,9.2722,-0.8855,0.0,,0,0,1,,,,,,,-69.10999999999999,0.040000000000000036,0.1100000000000012,-5.08,3.7,24.0,-126,-75,-116,0,-1,-1,0,0,0,-1,0,0,0,0,0,1,0.7
O00238,325,K,N,-4.99,0.003,-7.5436,0.6154649999999999,0.0,-3.26,-0.038,0.998,15.4661,-0.3595,1.0,2.40452471495,0,0,1,,,,,,,14.069999999999993,0.16000000000000014,0.14999999999999858,4.33,-0.3999999999999999,-5.8,36,39,54,0,1,1,0,0,0,1,0,0,0,0,1,0,0.7
O00255,441,W,R,-11.93,0.0,,0.732398,0.0,4.01,1.311,1.0,11.2692,-2.2074,1.0,0.55881839618,0,1,0,,,,,,,30.03,0.6600000000000001,0.3500000000000014,-4.87,3.6,23.0,15,15,21,0,-1,-1,0,1,-1,-1,1,0,0,0,1,0,0.7
O00329,334,N,K,-5.13,0.002,,0.730579,0.0,-7.36,-1.2229999999999999,0.934,15.5866,-0.3595,0.0,130.086202646,0,0,1,124.21986345,5.0,,,,0.44487303382,-14.069999999999993,-0.16000000000000014,-0.14999999999999858,-4.33,0.3999999999999999,5.8,-36,-39,-54,0,-1,-1,0,0,0,-1,0,0,0,0,-1,0,0.7
O00400,113,S,R,-4.83,0.0,-6.4115,0.542737,0.0,0.14,1.311,1.0,8.4452,-0.8855,1.0,,0,1,0,,,,,,,-69.10999999999999,0.040000000000000036,0.1100000000000012,-5.08,3.7,24.0,-126,-75,-116,0,-1,-1,0,0,0,-1,0,0,0,0,0,1,0.7
O00459,373,G,R,-7.38,0.0,-5.1863,0.706548,0.0,3.69,1.0979999999999999,0.9990000000000001,15.323,-1.8796,1.0,,0,0,1,,,,,,,-99.13,0.16999999999999993,0.5600000000000005,-4.79,4.1,37.0,-159,-100,-196,0,-1,-1,0,0,-1,-1,0,1,-1,0,0,1,0.7
O00499,35,K,N,-4.76,0.0,,0.706298,0.0,2.12,0.128,0.995,7.3205,-0.3595,1.0,,0,0,1,,,,,,,14.069999999999993,0.16000000000000014,0.14999999999999858,4.33,-0.3999999999999999,-5.8,36,39,54,0,1,1,0,0,0,1,0,0,0,0,1,0,0.7
O00555,1455,V,L,-2.97,0.002,,0.732398,7.7e-05,4.88,1.026,0.746,16.8346,0.0356,1.0,,0,1,0,,,,,,,-14.03,-0.040000000000000036,0.01999999999999957,-0.020000000000000462,0.4000000000000004,15.0,-26,-19,-20,0,0,0,0,0,0,0,0,0,0,0,0,0,0.7
O00628,217,G,R,-6.6,0.002,,0.706298,1e-06,4.98,1.176,0.7490000000000001,13.9923,-1.8796,0.0,,1,0,0,,,,,,,-99.13,0.16999999999999993,0.5600000000000005,-4.79,4.1,37.0,-159,-100,-196,0,-1,-1,0,0,-1,-1,0,1,-1,0,0,1,0.7
O14521,1,M,I,-1.37,0.0,,0.441713,0.000455,5.16,1.176,0.376,14.029000000000002,0.4164,0.0,,0,0,1,,,,,,,18.03,-0.1599999999999997,-0.3899999999999988,-0.27999999999999936,-2.6,-15.0,2,0,20,0,0,0,0,0,0,0,0,-1,0,1,0,0,0.7
O14649,97,G,R,-7.71,0.0,-8.2707,0.5171819999999999,1e-06,5.14,1.0070000000000001,0.9570000000000001,16.4547,-1.8796,1.0,55.149657474833326,0,0,1,30.445122075,,,,,0.36849753463,-99.13,0.16999999999999993,0.5600000000000005,-4.79,4.1,37.0,-159,-100,-196,0,-1,-1,0,0,-1,-1,0,1,-1,0,0,1,0.7
O14649,141,H,Q,-1.53,0.223,,0.446893,0.0,4.38,0.9470000000000001,0.9990000000000001,13.1844,0.2111,0.0,69.38325923908334,0,1,0,8.001930836,,,,,0.24707731561,9.009999999999991,-0.3499999999999999,0.03999999999999915,1.9399999999999995,0.2999999999999998,-1.0,12,9,13,0,1,1,0,0,0,1,1,0,0,0,1,0,0.8999999999999568
O14649,221,V,L,-2.85,0.023,-5.4148,0.5977399999999999,0.001017,4.72,1.083,0.997,15.5289,0.0356,1.0,10.573521436991667,0,1,0,9.7895182769,,,,,0.15663229243,-14.03,-0.040000000000000036,0.01999999999999957,-0.020000000000000462,0.4000000000000004,15.0,-26,-19,-20,0,0,0,0,0,0,0,0,0,0,0,0,0,0.7
O14773,77,G,R,-7.02,0.0,-4.0633,0.542737,0.0,5.0,1.026,0.727,12.1369,-1.8796,1.0,8.891377023433334,0,0,1,,,,,,,-99.13,0.16999999999999993,0.5600000000000005,-4.79,4.1,37.0,-159,-100,-196,0,-1,-1,0,0,-1,-1,0,1,-1,0,0,1,0.7
O14773,422,Q,H,-4.56,0.001,,0.732398,0.0,5.08,1.026,0.972,15.2071,0.2111,0.0,0.3326486729966666,0,0,1,,,,,,,-9.009999999999991,0.3499999999999999,-0.03999999999999915,-1.9399999999999995,-0.2999999999999998,1.0,-12,-9,-13,0,-1,-1,0,0,0,-1,-1,0,0,0,-1,0,0.7
O15020,1119,S,R,-1.1,0.006,,0.706548,0.0016539999999999999,-2.03,-0.36,0.996,12.3753,-0.8855,1.0,,0,1,0,,,,,,,-69.10999999999999,0.040000000000000036,0.1100000000000012,-5.08,3.7,24.0,-126,-75,-116,0,-1,-1,0,0,0,-1,0,0,0,0,0,1,0.8999999999999568
O15078,7,W,C,-5.41,0.0,,0.660085,0.00025499999999999996,5.03,1.026,1.0,16.3119,-2.3761,0.0,,0,1,0,,,,,,,83.07,0.8700000000000001,-0.8899999999999988,0.8199999999999994,-3.4,-24.0,134,77,113,0,0,0,0,0,-1,-1,1,0,0,-1,1,0,0.7
O15118,1212,V,L,-2.19,0.011,-4.4014,0.706548,8e-06,5.78,1.022,1.0,20.0203,0.0356,1.0,21.1057150912,0,1,0,,,,,,,-14.03,-0.040000000000000036,0.01999999999999957,-0.020000000000000462,0.4000000000000004,15.0,-26,-19,-20,0,0,0,0,0,0,0,0,0,0,0,0,0,0.7
O15146,605,M,I,-1.47,0.231,-1.89,0.487112,0.0,6.08,1.176,1.0,17.8194,0.4164,1.0,,1,0,0,,,,,,,18.03,-0.1599999999999997,-0.3899999999999988,-0.27999999999999936,-2.6,-15.0,2,0,20,0,0,0,0,0,0,0,0,-1,0,1,0,0,0.7
O15239,37,R,S,-5.25,0.055,-4.8032,,0.0,-2.11,-0.488,0.157,10.1339,-0.8855,1.0,106.336518535,0,0,1,73.277698292,2.0,,,,0.64371979072,69.10999999999999,-0.040000000000000036,-0.1100000000000012,5.08,-3.7,-24.0,126,75,116,0,1,1,0,0,0,1,0,0,0,0,0,-1,0.7
O15247,101,H,Q,0.84,0.014,,,0.0006889999999999999,-0.28600000000000003,0.9620000000000001,1.0,4.9860000000000015,0.2111,0.0,119.45723117666664,0,0,1,73.55155358100001,1.0,,,,0.6656389597300001,9.009999999999991,-0.3499999999999999,0.03999999999999915,1.9399999999999995,0.2999999999999998,-1.0,12,9,13,0,1,1,0,0,0,1,1,0,0,0,1,0,0.7
O15259,342,G,R,-3.29,0.002,,0.6154649999999999,0.0,5.79,1.026,0.9840000000000001,17.535,-1.8796,0.0,,0,0,1,,,,,,,-99.13,0.16999999999999993,0.5600000000000005,-4.79,4.1,37.0,-159,-100,-196,0,-1,-1,0,0,-1,-1,0,1,-1,0,0,1,0.7
O15305,119,F,L,-5.82,0.001,-6.686,0.706548,0.0,5.43,1.022,0.9990000000000001,9.941,-0.1027,1.0,52.436772926500005,0,0,1,52.368293533,,,,,0.80193856925,34.00999999999999,-0.5299999999999998,-0.4699999999999989,-0.5,-1.0,7.0,35,11,38,0,0,0,0,0,0,0,1,-1,0,0,0,0,0.7
O15305,144,F,L,-5.72,0.001,-7.2348,0.706548,0.0,5.43,1.1340000000000001,0.983,14.6665,-0.1027,1.0,1.68292760805,0,1,0,,,,,,,34.00999999999999,-0.5299999999999998,-0.4699999999999989,-0.5,-1.0,7.0,35,11,38,0,0,0,0,0,0,0,1,-1,0,0,0,0,0.7
O15305,226,T,S,-3.78,0.001,-5.2499,0.706548,0.0,5.22,1.022,0.11199999999999999,18.1365,0.6029,1.0,0.0,1,0,0,,,,,,,14.03,-0.1200000000000001,-0.05000000000000071,-0.08000000000000007,0.10000000000000007,1.0,23,20,22,0,0,0,0,0,0,0,0,0,0,0,1,-1,0.7
O15305,241,C,S,-2.99,0.024,-7.2452,0.706548,0.0,5.22,1.17,0.09699999999999999,18.1365,-0.982,1.0,1.164574736925,0,1,0,,,,,,,16.069999999999993,-0.25,1.129999999999999,-0.6099999999999994,3.3,23.0,7,13,24,0,0,0,0,1,0,1,0,0,0,1,0,-1,0.7
O15360,1,M,L,-0.8,0.0,,0.441713,0.093066,3.13,0.9990000000000001,0.011000000000000001,7.9068,0.8988,0.0,,0,0,1,,,,,,,18.03,-0.1599999999999997,-0.3899999999999988,-0.2400000000000002,-1.9,9.0,3,0,23,0,0,0,0,0,0,0,0,-1,0,1,0,0,0.7
O15360,8,N,K,-0.16,0.226,,0.441713,0.166706,-8.45,-0.293,0.0,2.6799,-0.3595,0.0,,0,0,1,,,,,,,-14.069999999999993,-0.16000000000000014,-0.14999999999999858,-4.33,0.3999999999999999,5.8,-36,-39,-54,0,-1,-1,0,0,0,-1,0,0,0,0,-1,0,0.9
O15360,953,D,E,-1.18,0.465,,0.706548,0.0038420000000000004,2.05,1.1079999999999999,0.9309999999999999,5.2664,0.6092,0.0,,0,1,0,,,,,,,-14.019999999999984,-0.31000000000000005,-0.07000000000000027,-0.4500000000000002,0.0,8.2,-36,-23,-38,0,0,0,0,0,0,0,0,0,0,0,0,0,0.9
O15537,96,W,R,-11.04,0.023,-4.0182,,0.0,5.43,1.3119999999999998,0.9990000000000001,14.5362,-2.2074,1.0,50.3170758316875,0,0,1,,,,,,,30.03,0.6600000000000001,0.3500000000000014,-4.87,3.6,23.0,15,15,21,0,-1,-1,0,1,-1,-1,1,0,0,0,1,0,0.7
O15537,109,G,R,-2.86,0.106,-4.5753,,0.0,5.43,1.026,1.0,18.3184,-1.8796,1.0,8.574685050049997,0,0,1,,,,,,,-99.13,0.16999999999999993,0.5600000000000005,-4.79,4.1,37.0,-159,-100,-196,0,-1,-1,0,0,-1,-1,0,1,-1,0,0,1,0.7
O15553,479,F,L,1.84,1.0,,0.5536760000000001,0.72349,-0.14300000000000002,-0.125,0.018000000000000002,2.3277,-0.1027,0.0,112.6638508368333,0,1,0,28.892626263,,,,,0.46228202021,34.00999999999999,-0.5299999999999998,-0.4699999999999989,-0.5,-1.0,7.0,35,11,38,0,0,0,0,0,0,0,1,-1,0,0,0,0,0.7
O15553,680,M,I,-0.13,0.359,0.7334,0.554377,0.061831,-3.32,-1.02,0.016,5.9184,0.4164,1.0,75.24358052557145,0,0,1,71.478015027,,,,,1.2783947745,18.03,-0.1599999999999997,-0.3899999999999988,-0.27999999999999936,-2.6,-15.0,2,0,20,0,0,0,0,0,0,0,0,-1,0,1,0,0,0.7
O43175,140,G,R,-7.97,0.0,-6.5708,0.7223189999999999,0.0,5.68,1.172,0.996,18.3597,-1.8796,1.0,31.449212638785713,1,0,0,31.217151749,2.0,,,,0.27486207526,-99.13,0.16999999999999993,0.5600000000000005,-4.79,4.1,37.0,-159,-100,-196,0,-1,-1,0,0,-1,-1,0,1,-1,0,0,1,0.7
O43318,168,G,R,-7.59,0.018000000000000002,,0.732398,0.0,5.18,1.023,0.996,18.6815,-1.8796,1.0,5.877339418985001,0,0,1,5.5632284866,1.0,,,,0.037152621583,-99.13,0.16999999999999993,0.5600000000000005,-4.79,4.1,37.0,-159,-100,-196,0,-1,-1,0,0,-1,-1,0,1,-1,0,0,1,0.7
O43462,87,M,I,-2.38,0.0,,,0.0,5.81,1.176,1.0,19.0176,0.4164,0.0,,0,1,0,,,,,,,18.03,-0.1599999999999997,-0.3899999999999988,-0.27999999999999936,-2.6,-15.0,2,0,20,0,0,0,0,0,0,0,0,-1,0,1,0,0,0.7
O43462,505,L,F,-2.51,0.008,,,0.0,3.98,1.176,1.0,8.3492,-0.1027,0.0,,0,1,0,,,,,,,-34.00999999999999,0.5299999999999998,0.4699999999999989,0.5,1.0,-7.0,-35,-11,-38,0,0,0,0,0,0,0,-1,1,0,0,0,0,0.7
O43502,138,L,F,-3.59,0.003,-5.2898,0.706298,0.0,2.57,0.228,0.997,8.5011,-0.1027,1.0,,0,1,0,,,,,,,-34.00999999999999,0.5299999999999998,0.4699999999999989,0.5,1.0,-7.0,-35,-11,-38,0,0,0,0,0,0,0,-1,1,0,0,0,0,0.7
O43511,334,G,V,-7.9,0.001,-8.5648,0.5536760000000001,0.0,5.62,1.176,0.993,20.024,-2.6382,1.0,,0,0,1,,,,,,,-42.08000000000001,0.02000000000000001,-0.01999999999999957,0.009999999999999787,-4.6000000000000005,-19.0,-76,-57,-117,0,0,0,0,-1,0,0,0,0,0,0,-1,1,0.7
O43511,335,F,L,-3.89,0.727,-3.9319,0.5536760000000001,0.0,5.62,1.138,0.9990000000000001,15.8248,-0.1027,1.0,,0,0,1,,,,,,,34.00999999999999,-0.5299999999999998,-0.4699999999999989,-0.5,-1.0,7.0,35,11,38,0,0,0,0,0,0,0,1,-1,0,0,0,0,0.7
O43511,457,N,K,-5.98,0.0,-8.282,0.693307,0.0,5.45,1.026,1.0,12.938,-0.3595,1.0,,0,1,0,,,,,,,-14.069999999999993,-0.16000000000000014,-0.14999999999999858,-4.33,0.3999999999999999,5.8,-36,-39,-54,0,-1,-1,0,0,0,-1,0,0,0,0,-1,0,0.7
O43520,78,H,Q,-0.06,0.952,,0.732398,0.21115799999999998,-11.5,-0.5329999999999999,0.9890000000000001,3.7639,0.2111,1.0,,0,0,1,,,,,,,9.009999999999991,-0.3499999999999999,0.03999999999999915,1.9399999999999995,0.2999999999999998,-1.0,12,9,13,0,1,1,0,0,0,1,1,0,0,0,1,0,0.9
O43520,814,K,N,-0.35,0.166,,0.706548,0.0,3.97,1.026,1.0,9.7338,-0.3595,0.0,,0,1,0,,,,,,,14.069999999999993,0.16000000000000014,0.14999999999999858,4.33,-0.3999999999999999,-5.8,36,39,54,0,1,1,0,0,0,1,0,0,0,0,1,0,0.9
O43520,892,G,R,-7.61,0.001,,0.706548,0.0,5.7,1.022,0.616,19.4255,-1.8796,0.0,,0,0,1,,,,,,,-99.13,0.16999999999999993,0.5600000000000005,-4.79,4.1,37.0,-159,-100,-196,0,-1,-1,0,0,-1,-1,0,1,-1,0,0,1,0.7
O43525,309,W,R,-13.41,0.0,-9.0947,0.638212,0.0,5.51,1.3119999999999998,1.0,15.0865,-2.2074,1.0,,0,1,0,,,,,,,30.03,0.6600000000000001,0.3500000000000014,-4.87,3.6,23.0,15,15,21,0,-1,-1,0,1,-1,-1,1,0,0,0,1,0,0.7
O43526,204,Q,H,-4.43,0.0,-6.3516,0.695654,0.004739,0.6609999999999999,0.129,1.0,6.4735,0.2111,1.0,6.746585563840001,0,1,0,,,,,,,-9.009999999999991,0.3499999999999999,-0.03999999999999915,-1.9399999999999995,-0.2999999999999998,1.0,-12,-9,-13,0,-1,-1,0,0,0,-1,-1,0,0,0,-1,0,0.7
O43526,231,E,D,-2.67,0.001,-5.1258,0.712529,5.2000000000000004e-05,3.29,-0.253,0.935,8.9958,0.6092,1.0,83.09553609208331,0,1,0,92.04261666299999,1.0,,,,0.5417324769399999,14.019999999999984,0.31000000000000005,0.07000000000000027,0.4500000000000002,0.0,-8.2,36,23,38,0,0,0,0,0,0,0,0,0,0,0,0,0,0.7
O43526,281,G,R,-7.08,0.017,-6.7892,0.695654,0.000166,4.01,0.998,0.79,16.4798,-1.8796,1.0,45.640471346875,0,0,1,34.500526805999996,,,,,0.42155810273,-99.13,0.16999999999999993,0.5600000000000005,-4.79,4.1,37.0,-159,-100,-196,0,-1,-1,0,0,-1,-1,0,1,-1,0,0,1,0.7
O43526,291,R,S,-5.42,0.0,-6.7258,0.695654,2.9999999999999997e-05,1.85,0.998,0.9740000000000001,4.0959,-0.8855,1.0,116.55171865433334,0,1,0,85.380281767,1.0,1.0,,,1.3016451285,69.10999999999999,-0.040000000000000036,-0.1100000000000012,5.08,-3.7,-24.0,126,75,116,0,1,1,0,0,0,1,0,0,0,0,0,-1,0.7
O43526,305,F,L,-5.42,0.001,-5.553,0.695654,0.0,-5.44,-3.915,0.004,13.1466,-0.1027,1.0,51.84981015804167,0,1,0,49.921090961000004,1.0,,,,0.44953326274,34.00999999999999,-0.5299999999999998,-0.4699999999999989,-0.5,-1.0,7.0,35,11,38,0,0,0,0,0,0,0,1,-1,0,0,0,0,0.7
O43526,554,K,N,-4.51,0.0,-4.0952,0.646311,0.0013449999999999998,4.99,0.13,1.0,18.2551,-0.3595,1.0,104.50415984600001,0,0,1,26.563722639,1.0,1.0,,,0.67619287067,14.069999999999993,0.16000000000000014,0.14999999999999858,4.33,-0.3999999999999999,-5.8,36,39,54,0,1,1,0,0,0,1,0,0,0,0,1,0,0.7
O43526,588,R,S,-5.32,0.0,-5.4533,0.646311,0.29076599999999997,3.76,0.9520000000000001,1.0,10.2164,-0.8855,1.0,153.70249913833334,0,1,0,115.88056801,2.0,3.0,,,1.1236997576,69.10999999999999,-0.040000000000000036,-0.1100000000000012,5.08,-3.7,-24.0,126,75,116,0,1,1,0,0,0,1,0,0,0,0,0,-1,0.7
O43570,121,H,Q,-7.99,0.0,-6.6688,0.675385,0.0,5.19,1.176,1.0,17.3524,0.2111,1.0,2.6358677132135417,1,0,0,3.5733928434,,,,,1.0673921784,9.009999999999991,-0.3499999999999999,0.03999999999999915,1.9399999999999995,0.2999999999999998,-1.0,12,9,13,0,1,1,0,0,0,1,1,0,0,0,1,0,0.7
O43602,50,K,N,-3.53,0.001,,,0.0,2.57,0.129,0.9990000000000001,9.4794,-0.3595,0.0,147.89462638999996,0,0,1,52.056648923999994,,,,,0.40984779681,14.069999999999993,0.16000000000000014,0.14999999999999858,4.33,-0.3999999999999999,-5.8,36,39,54,0,1,1,0,0,0,1,0,0,0,0,1,0,0.7
O43602,223,G,R,-6.95,0.0,-5.7651,,2.8999999999999997e-05,3.86,1.026,0.927,14.7435,-1.8796,1.0,40.51660618414285,0,0,1,34.856264835,1.0,,,,0.43654061001,-99.13,0.16999999999999993,0.5600000000000005,-4.79,4.1,37.0,-159,-100,-196,0,-1,-1,0,0,-1,-1,0,1,-1,0,0,1,0.7
O43676,22,W,R,-8.67,0.0,,0.706298,0.0,5.11,1.1340000000000001,0.997,14.1733,-2.2074,0.0,83.00373817149999,0,0,1,40.828505711999995,,,,,0.37379931645,30.03,0.6600000000000001,0.3500000000000014,-4.87,3.6,23.0,15,15,21,0,-1,-1,0,1,-1,-1,1,0,0,0,1,0,0.7
O43766,11,T,S,0.24,0.7020000000000001,,0.441713,0.7714449999999999,2.96,1.173,0.01,8.2589,0.6029,1.0,,0,0,1,,,,,,,14.03,-0.1200000000000001,-0.05000000000000071,-0.08000000000000007,0.10000000000000007,1.0,23,20,22,0,0,0,0,0,0,0,0,0,0,0,1,-1,0.8999999999999568
O43897,182,M,L,-2.56,0.018000000000000002,-5.5487,0.638212,0.0,6.01,1.278,1.0,16.5285,0.8988,1.0,6.1916564884000005,0,1,0,6.1916564884000005,,,,,0.099066503815,18.03,-0.1599999999999997,-0.3899999999999988,-0.2400000000000002,-1.9,9.0,3,0,23,0,0,0,0,0,0,0,0,-1,0,1,0,0,0.7
O43933,1,M,L,-0.85,0.0,,0.441713,2e-06,5.39,1.138,0.48700000000000004,11.2587,0.8988,0.0,,0,0,1,,,,,,,18.03,-0.1599999999999997,-0.3899999999999988,-0.2400000000000002,-1.9,9.0,3,0,23,0,0,0,0,0,0,0,0,-1,0,1,0,0,0.7
O43933,757,L,F,-2.32,0.025,,0.706298,0.021366999999999997,0.0659,1.026,0.997,5.6873,-0.1027,0.0,,0,0,1,,,,,,,-34.00999999999999,0.5299999999999998,0.4699999999999989,0.5,1.0,-7.0,-35,-11,-38,0,0,0,0,0,0,0,-1,1,0,0,0,0,0.8999999999999568
O43933,1270,S,R,-2.21,0.006999999999999999,,0.732398,0.034288,4.09,1.207,1.0,9.7167,-0.8855,0.0,,0,0,1,,,,,,,-69.10999999999999,0.040000000000000036,0.1100000000000012,-5.08,3.7,24.0,-126,-75,-116,0,-1,-1,0,0,0,-1,0,0,0,0,0,1,0.8999999999999568
O60216,414,D,E,-0.8,0.205,,0.706548,0.0,5.53,1.3119999999999998,1.0,15.669,0.6092,0.0,,0,1,0,,,,,,,-14.019999999999984,-0.31000000000000005,-0.07000000000000027,-0.4500000000000002,0.0,8.2,-36,-23,-38,0,0,0,0,0,0,0,0,0,0,0,0,0,0.8999999999999568
O60260,161,K,N,-4.46,0.001,,0.5536760000000001,0.0,-4.99,0.19399999999999998,1.0,7.9433,-0.3595,1.0,53.58701381499999,0,0,1,48.804303813000004,2.0,1.0,,,0.7096970863600001,14.069999999999993,0.16000000000000014,0.14999999999999858,4.33,-0.3999999999999999,-5.8,36,39,54,0,1,1,0,0,0,1,0,0,0,0,1,0,0.7
O60260,192,M,L,0.03,0.055,,0.487112,0.00032900000000000003,5.39,0.203,0.981,11.8193,0.8988,1.0,15.185831768771427,0,0,1,17.568258107000002,,,,,0.28109212971,18.03,-0.1599999999999997,-0.3899999999999988,-0.2400000000000002,-1.9,9.0,3,0,23,0,0,0,0,0,0,0,0,-1,0,1,0,0,0.9
O60260,211,K,N,-4.56,0.0,,0.487112,2e-05,2.43,1.138,1.0,7.0196,-0.3595,1.0,19.51374611628572,0,1,0,22.378291634,2.0,,,,0.3468001927800001,14.069999999999993,0.16000000000000014,0.14999999999999858,4.33,-0.3999999999999999,-5.8,36,39,54,0,1,1,0,0,0,1,0,0,0,0,1,0,0.7
O60393,152,G,R,-2.98,0.008,,0.5171819999999999,,0.654,-0.23,0.0,4.107,-1.8796,0.0,,0,0,1,,,,,,,-99.13,0.16999999999999993,0.5600000000000005,-4.79,4.1,37.0,-159,-100,-196,0,-1,-1,0,0,-1,-1,0,1,-1,0,0,1,0.8999999999999568
O60393,350,V,L,-0.69,0.0,,0.5171819999999999,0.002245,4.55,1.026,0.988,11.2101,0.0356,0.0,,0,1,0,,,,,,,-14.03,-0.040000000000000036,0.01999999999999957,-0.020000000000000462,0.4000000000000004,15.0,-26,-19,-20,0,0,0,0,0,0,0,0,0,0,0,0,0,0.7
O60443,29,D,E,-1.93,0.0,,0.732398,0.0,0.305,0.32,0.997,5.5612,0.6092,1.0,,0,0,1,,,,,,,-14.019999999999984,-0.31000000000000005,-0.07000000000000027,-0.4500000000000002,0.0,8.2,-36,-23,-38,0,0,0,0,0,0,0,0,0,0,0,0,0,0.8999999999999568
O60481,253,C,S,-9.67,0.0,,,0.0,4.58,1.1340000000000001,1.0,11.8858,-0.982,1.0,,0,1,0,,,,,,,16.069999999999993,-0.25,1.129999999999999,-0.6099999999999994,3.3,23.0,7,13,24,0,0,0,0,1,0,1,0,0,0,1,0,-1,0.7
O60500,366,S,R,-4.98,0.002,-8.5327,0.580535,0.0,5.43,1.138,0.98,13.4886,-0.8855,1.0,,0,0,1,,,,,,,-69.10999999999999,0.040000000000000036,0.1100000000000012,-5.08,3.7,24.0,-126,-75,-116,0,-1,-1,0,0,0,-1,0,0,0,0,0,1,0.7
O60500,569,S,R,-3.86,0.002,-8.6397,0.6852189999999999,1.4999999999999999e-05,3.32,0.106,0.305,10.0947,-0.8855,1.0,,1,0,0,,,,,,,-69.10999999999999,0.040000000000000036,0.1100000000000012,-5.08,3.7,24.0,-126,-75,-116,0,-1,-1,0,0,0,-1,0,0,0,0,0,1,0.7
O60500,681,W,C,-11.42,0.0,,0.5977399999999999,0.0,4.76,1.026,0.998,15.2831,-2.3761,0.0,,1,0,0,,,,,,,83.07,0.8700000000000001,-0.8899999999999988,0.8199999999999994,-3.4,-24.0,134,77,113,0,0,0,0,0,-1,-1,1,0,0,-1,1,0,0.7
O60500,976,R,S,-5.22,0.0,-2.562,0.554377,0.0,0.255,-0.23800000000000002,0.85,3.7685,-0.8855,1.0,,1,0,0,,,,,,,69.10999999999999,-0.040000000000000036,-0.1100000000000012,5.08,-3.7,-24.0,126,75,116,0,1,1,0,0,0,1,0,0,0,0,0,-1,0.7
O60663,269,N,K,-5.74,0.0,-6.9719,0.497415,0.0,4.48,1.026,1.0,16.3167,-0.3595,1.0,,0,0,1,,,,,,,-14.069999999999993,-0.16000000000000014,-0.14999999999999858,-4.33,0.3999999999999999,5.8,-36,-39,-54,0,-1,-1,0,0,0,-1,0,0,0,0,-1,0,0.7
O60674,607,K,N,-2.82,0.026,,0.653281,0.0,2.42,0.212,1.0,9.0024,-0.3595,1.0,132.07485211419356,0,0,1,72.187301009,1.0,2.0,,,0.94632467717,14.069999999999993,0.16000000000000014,0.14999999999999858,4.33,-0.3999999999999999,-5.8,36,39,54,0,1,1,0,0,0,1,0,0,0,0,1,0,0.7
O60683,145,M,I,0.83,0.473,,0.67177,0.452042,0.272,0.113,0.47200000000000003,3.7444,0.4164,1.0,,0,1,0,,,,,,,18.03,-0.1599999999999997,-0.3899999999999988,-0.27999999999999936,-2.6,-15.0,2,0,20,0,0,0,0,0,0,0,0,-1,0,1,0,0,0.8999999999076431
O60683,290,H,Q,-7.38,0.0,-6.9752,0.7223189999999999,0.0,3.11,0.168,0.997,7.6489,0.2111,1.0,,0,0,1,,,,,,,9.009999999999991,-0.3499999999999999,0.03999999999999915,1.9399999999999995,0.2999999999999998,-1.0,12,9,13,0,1,1,0,0,0,1,1,0,0,0,1,0,0.7
O60832,350,M,I,-3.79,0.034,-4.7154,,0.0,5.7,1.176,1.0,17.3244,0.4164,1.0,,0,0,1,,,,,,,18.03,-0.1599999999999997,-0.3899999999999988,-0.27999999999999936,-2.6,-15.0,2,0,20,0,0,0,0,0,0,0,0,-1,0,1,0,0,0.7
O60832,402,G,R,-6.84,0.0,,,0.0,5.5,1.176,0.909,16.9591,-1.8796,0.0,,0,0,1,,,,,,,-99.13,0.16999999999999993,0.5600000000000005,-4.79,4.1,37.0,-159,-100,-196,0,-1,-1,0,0,-1,-1,0,1,-1,0,0,1,0.7
O60931,182,W,R,-11.5,0.0,,0.634777,0.0,4.65,1.135,0.698,13.9585,-2.2074,1.0,,0,0,1,,,,,,,30.03,0.6600000000000001,0.3500000000000014,-4.87,3.6,23.0,15,15,21,0,-1,-1,0,1,-1,-1,1,0,0,0,1,0,0.7
O60931,197,G,R,-6.86,0.001,,0.634777,0.0,4.92,1.172,0.97,17.4852,-1.8796,0.0,,0,0,1,,,,,,,-99.13,0.16999999999999993,0.5600000000000005,-4.79,4.1,37.0,-159,-100,-196,0,-1,-1,0,0,-1,-1,0,1,-1,0,0,1,0.7
O60931,308,G,R,-8.0,0.0,-9.2459,0.751926,0.0,5.41,1.176,0.978,18.5632,-1.8796,1.0,,0,1,0,,,,,,,-99.13,0.16999999999999993,0.5600000000000005,-4.79,4.1,37.0,-159,-100,-196,0,-1,-1,0,0,-1,-1,0,1,-1,0,0,1,0.7
O60931,323,N,K,-3.17,0.322,-6.3391,0.751926,0.0,-5.32,-0.8909999999999999,0.982,16.5582,-0.3595,1.0,,0,0,1,,,,,,,-14.069999999999993,-0.16000000000000014,-0.14999999999999858,-4.33,0.3999999999999999,5.8,-36,-39,-54,0,-1,-1,0,0,0,-1,0,0,0,0,-1,0,0.7
O60931,339,G,R,-8.0,0.0,,0.7223189999999999,0.0,5.2,1.176,0.935,18.1153,-1.8796,0.0,,0,1,0,,,,,,,-99.13,0.16999999999999993,0.5600000000000005,-4.79,4.1,37.0,-159,-100,-196,0,-1,-1,0,0,-1,-1,0,1,-1,0,0,1,0.7
O75027,208,E,D,-2.95,0.011,-6.1011,,0.0,4.42,0.20600000000000002,1.0,10.0099,0.6092,1.0,,0,1,0,,,,,,,14.019999999999984,0.31000000000000005,0.07000000000000027,0.4500000000000002,0.0,-8.2,36,23,38,0,0,0,0,0,0,0,0,0,0,0,0,0,0.7
O75030,313,K,N,-4.88,0.0,-6.2991,0.638212,0.0,4.97,0.228,1.0,9.6161,-0.3595,1.0,,0,1,0,,,,,,,14.069999999999993,0.16000000000000014,0.14999999999999858,4.33,-0.3999999999999999,-5.8,36,39,54,0,1,1,0,0,0,1,0,0,0,0,1,0,0.7
O75190,93,F,L,-5.51,0.031,,0.706548,0.000138,4.58,0.8290000000000001,0.972,17.7679,-0.1027,0.0,,0,0,1,,,,,,,34.00999999999999,-0.5299999999999998,-0.4699999999999989,-0.5,-1.0,7.0,35,11,38,0,0,0,0,0,0,0,1,-1,0,0,0,0,0.7
O75204,1,M,I,-0.91,0.0,,0.652421,0.0,5.71,0.9359999999999999,1.0,18.6281,0.4164,0.0,,0,0,1,,,,,,,18.03,-0.1599999999999997,-0.3899999999999988,-0.27999999999999936,-2.6,-15.0,2,0,20,0,0,0,0,0,0,0,0,-1,0,1,0,0,0.7
O75342,578,H,Q,-7.99,0.0,-7.5991,0.5977399999999999,0.0,-1.15,-0.48200000000000004,0.973,10.2638,0.2111,1.0,,0,0,1,,,,,,,9.009999999999991,-0.3499999999999999,0.03999999999999915,1.9399999999999995,0.2999999999999998,-1.0,12,9,13,0,1,1,0,0,0,1,1,0,0,0,1,0,0.7
O75369,1586,G,R,-7.77,0.0,-7.0907,0.706548,0.0,5.99,1.176,0.878,20.4635,-1.8796,1.0,,1,0,0,,,,,,,-99.13,0.16999999999999993,0.5600000000000005,-4.79,4.1,37.0,-159,-100,-196,0,-1,-1,0,0,-1,-1,0,1,-1,0,0,1,0.7
O75369,1834,G,R,-7.78,0.001,-6.5777,0.706548,0.0,5.24,1.176,0.996,18.8505,-1.8796,1.0,9.45131084955,1,0,0,,,,,,,-99.13,0.16999999999999993,0.5600000000000005,-4.79,4.1,37.0,-159,-100,-196,0,-1,-1,0,0,-1,-1,0,1,-1,0,0,1,0.7
O75443,1057,C,S,-8.54,0.0,,0.638212,0.0,5.23,1.1079999999999999,1.0,15.1423,-0.982,0.0,,0,0,1,,,,,,,16.069999999999993,-0.25,1.129999999999999,-0.6099999999999994,3.3,23.0,7,13,24,0,0,0,0,1,0,1,0,0,0,1,0,-1,0.7
O75462,284,W,C,-11.91,0.0,,0.8396819999999999,1e-05,4.78,0.9470000000000001,0.9990000000000001,15.6551,-2.3761,1.0,,0,0,1,,,,,,,83.07,0.8700000000000001,-0.8899999999999988,0.8199999999999994,-3.4,-24.0,134,77,113,0,0,0,0,0,-1,-1,1,0,0,-1,1,0,0.7
O75530,302,R,S,-5.3,0.101,,0.706298,0.0,5.62,1.3119999999999998,1.0,10.4657,-0.8855,0.0,144.19077688089857,0,0,1,93.83974378100001,1.0,2.0,,,1.3223295993000002,69.10999999999999,-0.040000000000000036,-0.1100000000000012,5.08,-3.7,-24.0,126,75,116,0,1,1,0,0,0,1,0,0,0,0,0,-1,0.7
O75648,25,R,S,-2.24,0.019,-2.7633,0.441713,2e-05,1.03,1.172,0.9620000000000001,8.1348,-0.8855,1.0,,0,1,0,,,,,,,69.10999999999999,-0.040000000000000036,-0.1100000000000012,5.08,-3.7,-24.0,126,75,116,0,1,1,0,0,0,1,0,0,0,0,0,-1,0.9
O75665,435,S,R,-2.33,0.171,,,0.009285,4.94,0.26899999999999996,1.0,4.2605,-0.8855,0.0,,0,1,0,,,,,,,-69.10999999999999,0.040000000000000036,0.1100000000000012,-5.08,3.7,24.0,-126,-75,-116,0,-1,-1,0,0,0,-1,0,0,0,0,0,1,0.7
O75712,86,C,S,-7.1,0.185,-4.4678,0.713056,0.0,5.85,1.138,0.8059999999999999,11.2905,-0.982,1.0,,0,0,1,,,,,,,16.069999999999993,-0.25,1.129999999999999,-0.6099999999999994,3.3,23.0,7,13,24,0,0,0,0,1,0,1,0,0,0,1,0,-1,0.7