p_vid,aa_pos,aa_ref,aa_alt,provean_score,sift_score,evm_epistatic_score,integrated_fitCons_score,LRT_score,GERP++_RS,phyloP30way_mammalian,phastCons30way_mammalian,SiPhy_29way_logOdds,blosum100,in_domain,asa_mean,aa_psipred_E,aa_psipred_H,aa_psipred_C,bsa_max,h_bond_max,salt_bridge_max,disulfide_bond_max,covelent_bond_max,solv_ne_abs_max,mw_delta,pka_delta,pkb_delta,pi_delta,hi_delta,pbr_delta,avbr_delta,vadw_delta,asa_delta,cyclic_delta,charge_delta,positive_delta,negative_delta,hydrophobic_delta,polar_delta,ionizable_delta,aromatic_delta,aliphatic_delta,hbond_delta,sulfur_delta,essential_delta,size_delta,weight
O00238,325,K,N,-4.99,0.003,-7.5436,0.6154649999999999,0.0,-3.26,-0.038,0.998,15.4661,-0.3595,1.0,2.40452471495,0,0,1,,,,,,,14.069999999999993,0.16000000000000014,0.14999999999999858,4.33,-0.3999999999999999,-5.8,36,39,54,0,1,1,0,0,0,1,0,0,0,0,1,0,1.0
O00255,441,W,R,-11.93,0.0,,0.732398,0.0,4.01,1.311,1.0,11.2692,-2.2074,1.0,0.55881839618,0,1,0,,,,,,,30.03,0.6600000000000001,0.3500000000000014,-4.87,3.6,23.0,15,15,21,0,-1,-1,0,1,-1,-1,1,0,0,0,1,0,0.5000316803530372
O00329,334,N,K,-5.13,0.002,,0.730579,0.0,-7.36,-1.2229999999999999,0.934,15.5866,-0.3595,0.0,130.086202646,0,0,1,124.21986345,5.0,,,,0.44487303382,-14.069999999999993,-0.16000000000000014,-0.14999999999999858,-4.33,0.3999999999999999,5.8,-36,-39,-54,0,-1,-1,0,0,0,-1,0,0,0,0,-1,0,1.0
O00400,113,S,R,-4.83,0.0,-6.4115,0.542737,0.0,0.14,1.311,1.0,8.4452,-0.8855,1.0,,0,1,0,,,,,,,-69.10999999999999,0.040000000000000036,0.1100000000000012,-5.08,3.7,24.0,-126,-75,-116,0,-1,-1,0,0,0,-1,0,0,0,0,0,1,1.0
O00459,373,G,R,-7.38,0.0,-5.1863,0.706548,0.0,3.69,1.0979999999999999,0.9990000000000001,15.323,-1.8796,1.0,,0,0,1,,,,,,,-99.13,0.16999999999999993,0.5600000000000005,-4.79,4.1,37.0,-159,-100,-196,0,-1,-1,0,0,-1,-1,0,1,-1,0,0,1,6.336070607455965e-05
O00499,35,K,N,-4.76,0.0,,0.706298,0.0,2.12,0.128,0.995,7.3205,-0.3595,1.0,,0,0,1,,,,,,,14.069999999999993,0.16000000000000014,0.14999999999999858,4.33,-0.3999999999999999,-5.8,36,39,54,0,1,1,0,0,0,1,0,0,0,0,1,0,1.0
O00555,1455,V,L,-2.97,0.002,,0.732398,7.7e-05,4.88,1.026,0.746,16.8346,0.0356,1.0,,0,1,0,,,,,,,-14.03,-0.040000000000000036,0.01999999999999957,-0.020000000000000462,0.4000000000000004,15.0,-26,-19,-20,0,0,0,0,0,0,0,0,0,0,0,0,0,1.0
O14521,1,M,I,-1.37,0.0,,0.441713,0.000455,5.16,1.176,0.376,14.029000000000002,0.4164,0.0,,0,0,1,,,,,,,18.03,-0.1599999999999997,-0.3899999999999988,-0.27999999999999936,-2.6,-15.0,2,0,20,0,0,0,0,0,0,0,0,-1,0,1,0,0,0.5000316803530372
O14649,97,G,R,-7.71,0.0,-8.2707,0.5171819999999999,1e-06,5.14,1.0070000000000001,0.9570000000000001,16.4547,-1.8796,1.0,55.149657474833326,0,0,1,30.445122075,,,,,0.36849753463,-99.13,0.16999999999999993,0.5600000000000005,-4.79,4.1,37.0,-159,-100,-196,0,-1,-1,0,0,-1,-1,0,1,-1,0,0,1,1.0
O14649,221,V,L,-2.85,0.023,-5.4148,0.5977399999999999,0.001017,4.72,1.083,0.997,15.5289,0.0356,1.0,10.573521436991667,0,1,0,9.7895182769,,,,,0.15663229243,-14.03,-0.040000000000000036,0.01999999999999957,-0.020000000000000462,0.4000000000000004,15.0,-26,-19,-20,0,0,0,0,0,0,0,0,0,0,0,0,0,1.0
O15078,7,W,C,-5.41,0.0,,0.660085,0.00025499999999999996,5.03,1.026,1.0,16.3119,-2.3761,0.0,,0,1,0,,,,,,,83.07,0.8700000000000001,-0.8899999999999988,0.8199999999999994,-3.4,-24.0,134,77,113,0,0,0,0,0,-1,-1,1,0,0,-1,1,0,0.5000316803530372
O15239,37,R,S,-5.25,0.055,-4.8032,,0.0,-2.11,-0.488,0.157,10.1339,-0.8855,1.0,106.336518535,0,0,1,73.277698292,2.0,,,,0.64371979072,69.10999999999999,-0.040000000000000036,-0.1100000000000012,5.08,-3.7,-24.0,126,75,116,0,1,1,0,0,0,1,0,0,0,0,0,-1,1.0
O15537,96,W,R,-11.04,0.023,-4.0182,,0.0,5.43,1.3119999999999998,0.9990000000000001,14.5362,-2.2074,1.0,50.3170758316875,0,0,1,,,,,,,30.03,0.6600000000000001,0.3500000000000014,-4.87,3.6,23.0,15,15,21,0,-1,-1,0,1,-1,-1,1,0,0,0,1,0,0.5000316803530372
O43318,168,G,R,-7.59,0.018000000000000002,,0.732398,0.0,5.18,1.023,0.996,18.6815,-1.8796,1.0,5.877339418985001,0,0,1,5.5632284866,1.0,,,,0.037152621583,-99.13,0.16999999999999993,0.5600000000000005,-4.79,4.1,37.0,-159,-100,-196,0,-1,-1,0,0,-1,-1,0,1,-1,0,0,1,1.0
O43462,87,M,I,-2.38,0.0,,,0.0,5.81,1.176,1.0,19.0176,0.4164,0.0,,0,1,0,,,,,,,18.03,-0.1599999999999997,-0.3899999999999988,-0.27999999999999936,-2.6,-15.0,2,0,20,0,0,0,0,0,0,0,0,-1,0,1,0,0,1.0
O43462,505,L,F,-2.51,0.008,,,0.0,3.98,1.176,1.0,8.3492,-0.1027,0.0,,0,1,0,,,,,,,-34.00999999999999,0.5299999999999998,0.4699999999999989,0.5,1.0,-7.0,-35,-11,-38,0,0,0,0,0,0,0,-1,1,0,0,0,0,1.0
O43511,457,N,K,-5.98,0.0,-8.282,0.693307,0.0,5.45,1.026,1.0,12.938,-0.3595,1.0,,0,1,0,,,,,,,-14.069999999999993,-0.16000000000000014,-0.14999999999999858,-4.33,0.3999999999999999,5.8,-36,-39,-54,0,-1,-1,0,0,0,-1,0,0,0,0,-1,0,0.5000316803530372
O43526,204,Q,H,-4.43,0.0,-6.3516,0.695654,0.004739,0.6609999999999999,0.129,1.0,6.4735,0.2111,1.0,6.746585563840001,0,1,0,,,,,,,-9.009999999999991,0.3499999999999999,-0.03999999999999915,-1.9399999999999995,-0.2999999999999998,1.0,-12,-9,-13,0,-1,-1,0,0,0,-1,-1,0,0,0,-1,0,0.5000316803530372
O43526,231,E,D,-2.67,0.001,-5.1258,0.712529,5.2000000000000004e-05,3.29,-0.253,0.935,8.9958,0.6092,1.0,83.09553609208331,0,1,0,92.04261666299999,1.0,,,,0.5417324769399999,14.019999999999984,0.31000000000000005,0.07000000000000027,0.4500000000000002,0.0,-8.2,36,23,38,0,0,0,0,0,0,0,0,0,0,0,0,0,6.336070607455965e-05
O43526,281,G,R,-7.08,0.017,-6.7892,0.695654,0.000166,4.01,0.998,0.79,16.4798,-1.8796,1.0,45.640471346875,0,0,1,34.500526805999996,,,,,0.42155810273,-99.13,0.16999999999999993,0.5600000000000005,-4.79,4.1,37.0,-159,-100,-196,0,-1,-1,0,0,-1,-1,0,1,-1,0,0,1,0.5000316803530372
O43526,291,R,S,-5.42,0.0,-6.7258,0.695654,2.9999999999999997e-05,1.85,0.998,0.9740000000000001,4.0959,-0.8855,1.0,116.55171865433334,0,1,0,85.380281767,1.0,1.0,,,1.3016451285,69.10999999999999,-0.040000000000000036,-0.1100000000000012,5.08,-3.7,-24.0,126,75,116,0,1,1,0,0,0,1,0,0,0,0,0,-1,0.5000316803530372
O43526,305,F,L,-5.42,0.001,-5.553,0.695654,0.0,-5.44,-3.915,0.004,13.1466,-0.1027,1.0,51.84981015804167,0,1,0,49.921090961000004,1.0,,,,0.44953326274,34.00999999999999,-0.5299999999999998,-0.4699999999999989,-0.5,-1.0,7.0,35,11,38,0,0,0,0,0,0,0,1,-1,0,0,0,0,0.5000316803530372
O43526,554,K,N,-4.51,0.0,-4.0952,0.646311,0.0013449999999999998,4.99,0.13,1.0,18.2551,-0.3595,1.0,104.50415984600001,0,0,1,26.563722639,1.0,1.0,,,0.67619287067,14.069999999999993,0.16000000000000014,0.14999999999999858,4.33,-0.3999999999999999,-5.8,36,39,54,0,1,1,0,0,0,1,0,0,0,0,1,0,1.0
O43526,588,R,S,-5.32,0.0,-5.4533,0.646311,0.29076599999999997,3.76,0.9520000000000001,1.0,10.2164,-0.8855,1.0,153.70249913833334,0,1,0,115.88056801,2.0,3.0,,,1.1236997576,69.10999999999999,-0.040000000000000036,-0.1100000000000012,5.08,-3.7,-24.0,126,75,116,0,1,1,0,0,0,1,0,0,0,0,0,-1,1.0
O43602,50,K,N,-3.53,0.001,,,0.0,2.57,0.129,0.9990000000000001,9.4794,-0.3595,0.0,147.89462638999996,0,0,1,52.056648923999994,,,,,0.40984779681,14.069999999999993,0.16000000000000014,0.14999999999999858,4.33,-0.3999999999999999,-5.8,36,39,54,0,1,1,0,0,0,1,0,0,0,0,1,0,0.5000316803530372
O43602,223,G,R,-6.95,0.0,-5.7651,,2.8999999999999997e-05,3.86,1.026,0.927,14.7435,-1.8796,1.0,40.51660618414285,0,0,1,34.856264835,1.0,,,,0.43654061001,-99.13,0.16999999999999993,0.5600000000000005,-4.79,4.1,37.0,-159,-100,-196,0,-1,-1,0,0,-1,-1,0,1,-1,0,0,1,0.5000316803530372
O43897,182,M,L,-2.56,0.018000000000000002,-5.5487,0.638212,0.0,6.01,1.278,1.0,16.5285,0.8988,1.0,6.1916564884000005,0,1,0,6.1916564884000005,,,,,0.099066503815,18.03,-0.1599999999999997,-0.3899999999999988,-0.2400000000000002,-1.9,9.0,3,0,23,0,0,0,0,0,0,0,0,-1,0,1,0,0,1.0
O60260,161,K,N,-4.46,0.001,,0.5536760000000001,0.0,-4.99,0.19399999999999998,1.0,7.9433,-0.3595,1.0,53.58701381499999,0,0,1,48.804303813000004,2.0,1.0,,,0.7096970863600001,14.069999999999993,0.16000000000000014,0.14999999999999858,4.33,-0.3999999999999999,-5.8,36,39,54,0,1,1,0,0,0,1,0,0,0,0,1,0,1.0
O60393,350,V,L,-0.69,0.0,,0.5171819999999999,0.002245,4.55,1.026,0.988,11.2101,0.0356,0.0,,0,1,0,,,,,,,-14.03,-0.040000000000000036,0.01999999999999957,-0.020000000000000462,0.4000000000000004,15.0,-26,-19,-20,0,0,0,0,0,0,0,0,0,0,0,0,0,1.0
O60481,253,C,S,-9.67,0.0,,,0.0,4.58,1.1340000000000001,1.0,11.8858,-0.982,1.0,,0,1,0,,,,,,,16.069999999999993,-0.25,1.129999999999999,-0.6099999999999994,3.3,23.0,7,13,24,0,0,0,0,1,0,1,0,0,0,1,0,-1,1.0
O60500,569,S,R,-3.86,0.002,-8.6397,0.6852189999999999,1.4999999999999999e-05,3.32,0.106,0.305,10.0947,-0.8855,1.0,,1,0,0,,,,,,,-69.10999999999999,0.040000000000000036,0.1100000000000012,-5.08,3.7,24.0,-126,-75,-116,0,-1,-1,0,0,0,-1,0,0,0,0,0,1,1.0
O60663,269,N,K,-5.74,0.0,-6.9719,0.497415,0.0,4.48,1.026,1.0,16.3167,-0.3595,1.0,,0,0,1,,,,,,,-14.069999999999993,-0.16000000000000014,-0.14999999999999858,-4.33,0.3999999999999999,5.8,-36,-39,-54,0,-1,-1,0,0,0,-1,0,0,0,0,-1,0,1.0
O60674,607,K,N,-2.82,0.026,,0.653281,0.0,2.42,0.212,1.0,9.0024,-0.3595,1.0,132.07485211419356,0,0,1,72.187301009,1.0,2.0,,,0.94632467717,14.069999999999993,0.16000000000000014,0.14999999999999858,4.33,-0.3999999999999999,-5.8,36,39,54,0,1,1,0,0,0,1,0,0,0,0,1,0,1.0
O60683,290,H,Q,-7.38,0.0,-6.9752,0.7223189999999999,0.0,3.11,0.168,0.997,7.6489,0.2111,1.0,,0,0,1,,,,,,,9.009999999999991,-0.3499999999999999,0.03999999999999915,1.9399999999999995,0.2999999999999998,-1.0,12,9,13,0,1,1,0,0,0,1,1,0,0,0,1,0,1.0
O60832,350,M,I,-3.79,0.034,-4.7154,,0.0,5.7,1.176,1.0,17.3244,0.4164,1.0,,0,0,1,,,,,,,18.03,-0.1599999999999997,-0.3899999999999988,-0.27999999999999936,-2.6,-15.0,2,0,20,0,0,0,0,0,0,0,0,-1,0,1,0,0,1.0
O60832,402,G,R,-6.84,0.0,,,0.0,5.5,1.176,0.909,16.9591,-1.8796,0.0,,0,0,1,,,,,,,-99.13,0.16999999999999993,0.5600000000000005,-4.79,4.1,37.0,-159,-100,-196,0,-1,-1,0,0,-1,-1,0,1,-1,0,0,1,1.0
O75027,208,E,D,-2.95,0.011,-6.1011,,0.0,4.42,0.20600000000000002,1.0,10.0099,0.6092,1.0,,0,1,0,,,,,,,14.019999999999984,0.31000000000000005,0.07000000000000027,0.4500000000000002,0.0,-8.2,36,23,38,0,0,0,0,0,0,0,0,0,0,0,0,0,1.0
O75030,313,K,N,-4.88,0.0,-6.2991,0.638212,0.0,4.97,0.228,1.0,9.6161,-0.3595,1.0,,0,1,0,,,,,,,14.069999999999993,0.16000000000000014,0.14999999999999858,4.33,-0.3999999999999999,-5.8,36,39,54,0,1,1,0,0,0,1,0,0,0,0,1,0,1.0
O75204,1,M,I,-0.91,0.0,,0.652421,0.0,5.71,0.9359999999999999,1.0,18.6281,0.4164,0.0,,0,0,1,,,,,,,18.03,-0.1599999999999997,-0.3899999999999988,-0.27999999999999936,-2.6,-15.0,2,0,20,0,0,0,0,0,0,0,0,-1,0,1,0,0,0.5000316803530372
O75369,1586,G,R,-7.77,0.0,-7.0907,0.706548,0.0,5.99,1.176,0.878,20.4635,-1.8796,1.0,,1,0,0,,,,,,,-99.13,0.16999999999999993,0.5600000000000005,-4.79,4.1,37.0,-159,-100,-196,0,-1,-1,0,0,-1,-1,0,1,-1,0,0,1,1.0
O75369,1834,G,R,-7.78,0.001,-6.5777,0.706548,0.0,5.24,1.176,0.996,18.8505,-1.8796,1.0,9.45131084955,1,0,0,,,,,,,-99.13,0.16999999999999993,0.5600000000000005,-4.79,4.1,37.0,-159,-100,-196,0,-1,-1,0,0,-1,-1,0,1,-1,0,0,1,1.0
O75462,284,W,C,-11.91,0.0,,0.8396819999999999,1e-05,4.78,0.9470000000000001,0.9990000000000001,15.6551,-2.3761,1.0,,0,0,1,,,,,,,83.07,0.8700000000000001,-0.8899999999999988,0.8199999999999994,-3.4,-24.0,134,77,113,0,0,0,0,0,-1,-1,1,0,0,-1,1,0,1.0
O75530,302,R,S,-5.3,0.101,,0.706298,0.0,5.62,1.3119999999999998,1.0,10.4657,-0.8855,0.0,144.19077688089857,0,0,1,93.83974378100001,1.0,2.0,,,1.3223295993000002,69.10999999999999,-0.040000000000000036,-0.1100000000000012,5.08,-3.7,-24.0,126,75,116,0,1,1,0,0,0,1,0,0,0,0,0,-1,1.0
O75665,435,S,R,-2.33,0.171,,,0.009285,4.94,0.26899999999999996,1.0,4.2605,-0.8855,0.0,,0,1,0,,,,,,,-69.10999999999999,0.040000000000000036,0.1100000000000012,-5.08,3.7,24.0,-126,-75,-116,0,-1,-1,0,0,0,-1,0,0,0,0,0,1,1.0
O75712,86,C,S,-7.1,0.185,-4.4678,0.713056,0.0,5.85,1.138,0.8059999999999999,11.2905,-0.982,1.0,,0,0,1,,,,,,,16.069999999999993,-0.25,1.129999999999999,-0.6099999999999994,3.3,23.0,7,13,24,0,0,0,0,1,0,1,0,0,0,1,0,-1,1.0
O75923,52,W,R,-6.91,0.0,-9.3995,0.706548,0.005587,4.91,1.138,1.0,12.7528,-2.2074,1.0,5.3666846468000005,1,0,0,4.174524690299998,,,,,0.066792395045,30.03,0.6600000000000001,0.3500000000000014,-4.87,3.6,23.0,15,15,21,0,-1,-1,0,1,-1,-1,1,0,0,0,1,0,0.5000316803530372
O75923,426,G,R,-7.39,0.0,-8.4794,0.67177,0.0,4.82,1.176,0.993,15.7634,-1.8796,1.0,,0,0,1,,,,,,,-99.13,0.16999999999999993,0.5600000000000005,-4.79,4.1,37.0,-159,-100,-196,0,-1,-1,0,0,-1,-1,0,1,-1,0,0,1,0.5000316803530372
O75923,1810,R,K,0.08,0.838,,0.706548,0.0,4.87,1.176,0.996,15.5424,1.0475,0.0,,1,0,0,,,,,,,28.00999999999999,-0.010000000000000231,0.08999999999999986,1.0199999999999996,-0.6000000000000001,-4.2,54,13,29,0,0,0,0,0,0,0,0,0,0,0,-1,0,6.336070607455965e-05
O76024,836,K,N,-1.93,0.062,,0.706548,0.0,4.82,0.226,1.0,10.3867,-0.3595,0.0,,0,0,1,,,,,,,14.069999999999993,0.16000000000000014,0.14999999999999858,4.33,-0.3999999999999999,-5.8,36,39,54,0,1,1,0,0,0,1,0,0,0,0,1,0,0.5000316803530372
O76039,176,W,R,-13.99,0.0,-7.5481,,0.0,5.6,1.138,0.982,14.7967,-2.2074,1.0,90.920501085,0,0,1,,,,,,,30.03,0.6600000000000001,0.3500000000000014,-4.87,3.6,23.0,15,15,21,0,-1,-1,0,1,-1,-1,1,0,0,0,1,0,0.5000316803530372
O76090,93,W,C,-12.82,0.0,-8.8066,0.5977399999999999,0.0,5.03,1.176,1.0,17.9727,-2.3761,1.0,,0,1,0,,,,,,,83.07,0.8700000000000001,-0.8899999999999988,0.8199999999999994,-3.4,-24.0,134,77,113,0,0,0,0,0,-1,-1,1,0,0,-1,1,0,1.0
O76090,296,N,K,-5.4,0.001,-7.0917,0.525926,0.0,3.95,0.9470000000000001,0.998,10.5453,-0.3595,1.0,,0,0,1,,,,,,,-14.069999999999993,-0.16000000000000014,-0.14999999999999858,-4.33,0.3999999999999999,5.8,-36,-39,-54,0,-1,-1,0,0,0,-1,0,0,0,0,-1,0,0.5000316803530372
O94972,109,C,S,-8.29,0.014,-6.045,0.732398,0.0,5.44,1.026,1.0,18.8305,-0.982,1.0,,0,0,1,,,,,,,16.069999999999993,-0.25,1.129999999999999,-0.6099999999999994,3.3,23.0,7,13,24,0,0,0,0,1,0,1,0,0,0,1,0,-1,1.0
O95140,240,F,L,-5.63,0.0,,0.706548,0.0,2.75,-0.242,0.993,8.9087,-0.1027,1.0,2.7269626616928577,0,1,0,,,,,,,34.00999999999999,-0.5299999999999998,-0.4699999999999989,-0.5,-1.0,7.0,35,11,38,0,0,0,0,0,0,0,1,-1,0,0,0,0,0.5000316803530372
O95140,357,K,N,-4.61,0.0,,0.706548,0.0,-3.4,-0.077,0.998,12.9518,-0.3595,0.0,16.969624047142855,0,1,0,1.1730384062,,,,,0.018768614499,14.069999999999993,0.16000000000000014,0.14999999999999858,4.33,-0.3999999999999999,-5.8,36,39,54,0,1,1,0,0,0,1,0,0,0,0,1,0,0.5000316803530372
O95255,411,N,K,-5.54,0.0,-8.0363,0.554377,0.000103,2.34,0.217,0.992,8.6373,-0.3595,1.0,,0,1,0,,,,,,,-14.069999999999993,-0.16000000000000014,-0.14999999999999858,-4.33,0.3999999999999999,5.8,-36,-39,-54,0,-1,-1,0,0,0,-1,0,0,0,0,-1,0,0.07143309719329104
O95394,297,D,E,-3.98,0.001,,0.732398,0.0,1.1,-0.045,0.995,9.6805,0.6092,0.0,,0,0,1,,,,,,,-14.019999999999984,-0.31000000000000005,-0.07000000000000027,-0.4500000000000002,0.0,8.2,-36,-23,-38,0,0,0,0,0,0,0,0,0,0,0,0,0,1.0
O95461,495,W,R,-13.92,0.0,-9.3666,0.706298,0.0,5.27,1.3019999999999998,1.0,15.2186,-2.2074,1.0,,0,0,1,,,,,,,30.03,0.6600000000000001,0.3500000000000014,-4.87,3.6,23.0,15,15,21,0,-1,-1,0,1,-1,-1,1,0,0,0,1,0,1.0
O95625,880,H,Q,-7.42,0.0,,0.732398,0.0,-2.42,0.321,0.998,10.9332,0.2111,1.0,,0,0,1,,,,,,,9.009999999999991,-0.3499999999999999,0.03999999999999915,1.9399999999999995,0.2999999999999998,-1.0,12,9,13,0,1,1,0,0,0,1,1,0,0,0,1,0,1.0
O95831,360,G,R,-7.95,0.0,-6.3007,,0.0,5.03,1.026,0.998,17.5074,-1.8796,1.0,42.07859342436842,0,0,1,24.757834153,1.0,,,,0.14037795277,-99.13,0.16999999999999993,0.5600000000000005,-4.79,4.1,37.0,-159,-100,-196,0,-1,-1,0,0,-1,-1,0,1,-1,0,0,1,1.0
P00439,1,M,I,-0.58,0.036000000000000004,,0.40479,0.7650680000000001,5.2,1.026,0.192,14.4281,0.4164,0.0,,0,0,1,,,,,,,18.03,-0.1599999999999997,-0.3899999999999988,-0.27999999999999936,-2.6,-15.0,2,0,20,0,0,0,0,0,0,0,0,-1,0,1,0,0,1.0
P00439,289,G,R,-7.8,0.0,-8.9223,0.638212,0.0,5.51,1.026,1.0,19.7791,-1.8796,1.0,0.6575628016276924,0,0,1,,,,,,,-99.13,0.16999999999999993,0.5600000000000005,-4.79,4.1,37.0,-159,-100,-196,0,-1,-1,0,0,-1,-1,0,1,-1,0,0,1,4.014833424713598e-09
P00441,38,G,R,-7.17,0.003,-6.158,0.706548,0.0,4.93,1.172,0.064,18.6846,-1.8796,1.0,35.61627746118274,0,0,1,39.687652758,1.0,,,,0.30421053332,-99.13,0.16999999999999993,0.5600000000000005,-4.79,4.1,37.0,-159,-100,-196,0,-1,-1,0,0,-1,-1,0,1,-1,0,0,1,0.5000316803530372
P00441,140,N,K,-5.53,0.0,-5.4865,0.7223189999999999,0.0,-2.16,-2.4,0.441,12.7863,-0.3595,1.0,51.825032595327905,0,0,1,98.349369295,2.0,,,,0.38560755151,-14.069999999999993,-0.16000000000000014,-0.14999999999999858,-4.33,0.3999999999999999,5.8,-36,-39,-54,0,-1,-1,0,0,0,-1,0,0,0,0,-1,0,0.5000316803530372
P00451,130,G,R,-7.66,0.0,-5.3023,,0.0,5.03,1.026,0.89,12.8452,-1.8796,1.0,0.04655783897666668,0,0,1,,,,,,,-99.13,0.16999999999999993,0.5600000000000005,-4.79,4.1,37.0,-159,-100,-196,0,-1,-1,0,0,-1,-1,0,1,-1,0,0,1,1.0
P00451,224,G,W,-5.33,0.0,-5.2883,,0.00044100000000000004,4.9,1.015,1.0,12.7831,-2.3741,1.0,32.17601183616667,0,0,1,,,,,,,-129.16,-0.4900000000000002,0.20999999999999908,0.08000000000000007,0.5,14.0,-174,-115,-217,0,0,0,0,-1,0,0,-1,1,-1,0,-1,1,1.0
P00451,345,V,L,-2.39,0.002,-6.4633,,1.3000000000000001e-05,4.25,1.026,1.0,11.1582,0.0356,1.0,1.3588160073999995,1,0,0,,,,,,,-14.03,-0.040000000000000036,0.01999999999999957,-0.020000000000000462,0.4000000000000004,15.0,-26,-19,-20,0,0,0,0,0,0,0,0,0,0,0,0,0,1.0
P00451,348,C,S,-8.43,0.002,-5.5077,,0.0,5.13,1.026,1.0,16.4032,-0.982,1.0,51.88776537283335,0,0,1,11.288001224,1.0,,,,0.1288387724,16.069999999999993,-0.25,1.129999999999999,-0.6099999999999994,3.3,23.0,7,13,24,0,0,0,0,1,0,1,0,0,0,1,0,-1,1.0
P00451,2248,W,C,-11.17,0.0,-9.9031,,0.0,5.33,1.026,0.9990000000000001,15.3953,-2.3761,1.0,54.00104359953333,1,0,0,45.555526513000004,1.0,,,,0.41214764855,83.07,0.8700000000000001,-0.8899999999999988,0.8199999999999994,-3.4,-24.0,134,77,113,0,0,0,0,0,-1,-1,1,0,0,-1,1,0,1.0
P00480,267,S,R,-4.88,0.001,-8.0308,,0.0,5.58,1.3119999999999998,1.0,14.9212,-0.8855,1.0,29.37282424400001,0,0,1,8.6963529143,,,,,0.13914164662999998,-69.10999999999999,0.040000000000000036,0.1100000000000012,-5.08,3.7,24.0,-126,-75,-116,0,-1,-1,0,0,0,-1,0,0,0,0,0,1,1.0
P00480,332,W,R,-9.49,0.002,-7.6465,,0.0,5.16,1.138,1.0,14.2907,-2.2074,1.0,14.998238974400001,0,1,0,2.9723893048,,,,,0.047558228877,30.03,0.6600000000000001,0.3500000000000014,-4.87,3.6,23.0,15,15,21,0,-1,-1,0,1,-1,-1,1,0,0,0,1,0,1.0
P00480,339,V,L,-0.75,0.063,-0.4483,,2e-06,5.33,1.176,1.0,18.1072,0.0356,1.0,0.440666683354,0,1,0,,,,,,,-14.03,-0.040000000000000036,0.01999999999999957,-0.020000000000000462,0.4000000000000004,15.0,-26,-19,-20,0,0,0,0,0,0,0,0,0,0,0,0,0,1.0
P00519,252,Q,H,-4.8,0.0,-5.8318,0.736574,0.0,6.03,1.171,1.0,12.8598,0.2111,1.0,103.95854812860789,0,0,1,40.436985655,1.0,,,,0.41507281968,-9.009999999999991,0.3499999999999999,-0.03999999999999915,-1.9399999999999995,-0.2999999999999998,1.0,-12,-9,-13,0,-1,-1,0,0,0,-1,-1,0,0,0,-1,0,1.0
P00519,317,F,L,-5.38,0.269,-2.7081,0.706548,0.0,4.22,0.127,0.992,12.0279,-0.1027,1.0,58.614040951828116,0,0,1,31.508645578000003,,,,,0.4361585042,34.00999999999999,-0.5299999999999998,-0.4699999999999989,-0.5,-1.0,7.0,35,11,38,0,0,0,0,0,0,0,1,-1,0,0,0,0,1.0
P00740,79,E,D,-2.37,0.0,-5.7038,,0.0,4.02,1.311,1.0,8.2882,0.6092,1.0,145.51142162,1,0,0,33.801420619,,,,1.0,0.31845814065,14.019999999999984,0.31000000000000005,0.07000000000000027,0.4500000000000002,0.0,-8.2,36,23,38,0,0,0,0,0,0,0,0,0,0,0,0,0,1.0
P00740,357,G,R,-7.95,0.001,-6.4561,,0.0,4.8,1.176,1.0,12.7407,-1.8796,1.0,0.634120389601111,0,0,1,1.1534929059,,,,,0.018455886495,-99.13,0.16999999999999993,0.5600000000000005,-4.79,4.1,37.0,-159,-100,-196,0,-1,-1,0,0,-1,-1,0,1,-1,0,0,1,1.0
P00740,442,G,R,-7.77,0.0,-7.8835,,0.0,5.59,1.176,1.0,17.4099,-1.8796,1.0,2.5979108516881486,1,0,0,3.8161251185,,,,,0.061058001896,-99.13,0.16999999999999993,0.5600000000000005,-4.79,4.1,37.0,-159,-100,-196,0,-1,-1,0,0,-1,-1,0,1,-1,0,0,1,1.0
P01106,39,E,D,,,,0.72623,0.005795000000000001,3.9,1.172,1.0,8.9469,0.6092,1.0,,0,0,1,,,,,,,14.019999999999984,0.31000000000000005,0.07000000000000027,0.4500000000000002,0.0,-8.2,36,23,38,0,0,0,0,0,0,0,0,0,0,0,0,0,1.0
P01111,13,G,R,-6.71,0.0,-5.1743,0.6276470000000001,2.2e-05,5.58,1.026,1.0,19.3769,-1.8796,1.0,57.631499055384616,0,0,1,40.383106224,1.0,,,,0.37214196541,-99.13,0.16999999999999993,0.5600000000000005,-4.79,4.1,37.0,-159,-100,-196,0,-1,-1,0,0,-1,-1,0,1,-1,0,0,1,1.0
P01111,61,Q,H,-4.43,0.006999999999999999,-5.7075,0.7223189999999999,4.3e-05,3.93,1.138,1.0,5.8174,0.2111,1.0,62.46794521499999,0,0,1,44.371181235,,,,,0.4783649758,-9.009999999999991,0.3499999999999999,-0.03999999999999915,-1.9399999999999995,-0.2999999999999998,1.0,-12,-9,-13,0,-1,-1,0,0,0,-1,-1,0,0,0,-1,0,0.5000316803530372
P01112,12,G,V,-7.21,0.008,-7.975,0.766844,0.0,3.0,1.026,0.174,14.1517,-2.6382,1.0,37.282647627654185,0,0,1,33.946746456,1.0,,,,0.36102891092,-42.08000000000001,0.02000000000000001,-0.01999999999999957,0.009999999999999787,-4.6000000000000005,-19.0,-76,-57,-117,0,0,0,0,-1,0,0,0,0,0,0,-1,1,6.336070607455965e-05
P01116,5,K,N,-3.84,0.0,-3.904,0.732398,0.0,4.55,0.193,1.0,8.8972,-0.3595,1.0,68.97532514689944,1,0,0,208.43553424,3.0,2.0,,,1.3058139568,14.069999999999993,0.16000000000000014,0.14999999999999858,4.33,-0.3999999999999999,-5.8,36,39,54,0,1,1,0,0,0,1,0,0,0,0,1,0,4.014833424713598e-09
P01116,72,M,L,-2.55,0.029,-5.0969,0.7223189999999999,0.0,5.77,1.12,1.0,15.5753,0.8988,1.0,10.44248993315736,0,1,0,55.28614209,1.0,,,,1.141098729,18.03,-0.1599999999999997,-0.3899999999999988,-0.2400000000000002,-1.9,9.0,3,0,23,0,0,0,0,0,0,0,0,-1,0,1,0,0,0.5000316803530372
P01130,1,M,I,-1.08,0.0,,0.441713,8e-05,3.67,1.074,0.008,11.1972,0.4164,0.0,,0,0,1,,,,,,,18.03,-0.1599999999999997,-0.3899999999999988,-0.27999999999999936,-2.6,-15.0,2,0,20,0,0,0,0,0,0,0,0,-1,0,1,0,0,1.0
P01130,1,M,L,-0.69,0.0,,0.441713,8e-05,3.67,1.197,0.008,9.013,0.8988,0.0,,0,0,1,,,,,,,18.03,-0.1599999999999997,-0.3899999999999988,-0.2400000000000002,-1.9,9.0,3,0,23,0,0,0,0,0,0,0,0,-1,0,1,0,0,6.336070607455965e-05
P01130,10,W,R,-0.98,0.001,,0.441713,0.593306,3.67,1.04,0.087,9.013,-2.2074,0.0,,0,0,1,,,,,,,30.03,0.6600000000000001,0.3500000000000014,-4.87,3.6,23.0,15,15,21,0,-1,-1,0,1,-1,-1,1,0,0,0,1,0,6.336070607455965e-05
P01130,100,D,E,-3.59,0.001,-6.9603,0.67177,1.2e-05,-3.98,-1.331,0.009000000000000001,13.6311,0.6092,1.0,0.6533186938500001,0,0,1,,,,,,,-14.019999999999984,-0.31000000000000005,-0.07000000000000027,-0.4500000000000002,0.0,8.2,-36,-23,-38,0,0,0,0,0,0,0,0,0,0,0,0,0,0.5000316803530372
P01130,121,C,S,-8.81,0.001,-10.013,0.67177,4e-06,5.44,1.1320000000000001,0.028999999999999998,14.4789,-0.982,1.0,31.453806991500002,1,0,0,15.84047126,2.0,,,,0.034247111627000004,16.069999999999993,-0.25,1.129999999999999,-0.6099999999999994,3.3,23.0,7,13,24,0,0,0,0,1,0,1,0,0,0,1,0,-1,0.5000316803530372
P01130,139,D,E,-3.62,0.0,-8.4656,0.67177,1.2e-05,-4.5,-1.6380000000000001,0.012,12.5107,0.6092,1.0,15.101356342953329,0,0,1,,,,,,,-14.019999999999984,-0.31000000000000005,-0.07000000000000027,-0.4500000000000002,0.0,8.2,-36,-23,-38,0,0,0,0,0,0,0,0,0,0,0,0,0,0.5000316803530372
P01130,140,E,D,-2.72,0.0,-9.3235,0.67177,1.9e-05,3.49,1.169,0.07200000000000001,8.3478,0.6092,1.0,37.638331061666655,0,0,1,8.3238117847,,,,,0.12308088424,14.019999999999984,0.31000000000000005,0.07000000000000027,0.4500000000000002,0.0,-8.2,36,23,38,0,0,0,0,0,0,0,0,0,0,0,0,0,6.336070607455965e-05
P01130,255,C,S,-9.19,0.005,-8.3007,0.67177,7.000000000000003e-06,5.1,1.123,0.872,13.8648,-0.982,1.0,61.49363956000001,0,0,1,31.746548026,,,,,0.029599472641,16.069999999999993,-0.25,1.129999999999999,-0.6099999999999994,3.3,23.0,7,13,24,0,0,0,0,1,0,1,0,0,0,1,0,-1,0.5000316803530372
P01130,256,D,E,-2.14,0.003,-7.8422,0.67177,0.005569,5.1,1.012,0.4920000000000001,17.2847,0.6092,1.0,88.63862494799996,0,0,1,11.780077089,,,,,0.13445521848,-14.019999999999984,-0.31000000000000005,-0.07000000000000027,-0.4500000000000002,0.0,8.2,-36,-23,-38,0,0,0,0,0,0,0,0,0,0,0,0,0,0.5000316803530372
P01130,338,C,S,-9.62,0.001,-10.9144,0.67177,4e-06,5.4,1.131,0.081,14.4079,-0.982,1.0,17.579165319111112,1,0,0,40.114589864,2.0,,,,0.30170068497,16.069999999999993,-0.25,1.129999999999999,-0.6099999999999994,3.3,23.0,7,13,24,0,0,0,0,1,0,1,0,0,0,1,0,-1,6.336070607455965e-05